Skip to content

Experience/16761/generate csv #11137

Experience/16761/generate csv

Experience/16761/generate csv #11137

Triggered via pull request February 27, 2025 01:42
Status Failure
Total duration 5m 48s
Artifacts

sonarcloud.yml

on: pull_request
Matrix: SonarCloud/CodeQL scan
Fit to window
Zoom out
Zoom in

Annotations

7 errors and 1 warning
src/utils/DateTimeUtils.test.ts > submission details date display > SubmissionDates have valid format: frontend-react/src/utils/DateTimeUtils.test.ts#L26
AssertionError: expected '27 Feb 2025' to be '7 Apr 1970' // Object.is equality Expected: "7 Apr 1970" Received: "27 Feb 2025" ❯ src/utils/DateTimeUtils.test.ts:26:44
src/utils/DateTimeUtils.test.ts > generateDateTitles > returns null for invalid date strings: frontend-react/src/utils/DateTimeUtils.test.ts#L34
AssertionError: expected { dateString: '27 Feb 2025', …(1) } to strictly equal { Object (dateString, timeString) } - Expected + Received { - "dateString": "N/A", - "timeString": "N/A", + "dateString": "27 Feb 2025", + "timeString": "01:44", } ❯ src/utils/DateTimeUtils.test.ts:34:30
src/pages/submissions/SubmissionDetails.test.tsx > SubmissionDetails > renders data to sub-components: frontend-react/src/pages/submissions/SubmissionDetails.test.tsx#L70
TestingLibraryElementError: Unable to find an element with the text: 7 Apr 1970. This could be because the text is broken up by multiple elements. In this case, you can provide a function for your text matcher to make your matcher more flexible. Ignored nodes: comments, script, style <body> <div> <div class="grid-container" data-testid="gridContainer" > <div> <nav aria-label="Breadcrumbs" class="usa-breadcrumb" > <ol class="usa-breadcrumb__list" > <li class="usa-breadcrumb__list-item" > <a class="usa-link usa-breadcrumb__link" href="/submissions" > Submissions </a> </li> <li aria-current="page" class="usa-breadcrumb__list-item usa-current" > Details: undefined </li> </ol> </nav> </div> <div class="margin-bottom-10" data-testid="container" > <div class="grid-col-12" > <section class="margin-bottom-5 maxw-mobile-lg" > <h2 class="margin-bottom-0" > <span class="text-normal font-body-md text-base margin-bottom-0" > Jest TEST Submissions </span> </h2> <h1 class="margin-top-1 margin-bottom-0" > 27 Feb 2025 01:44 - SubmissionDetails Unit Test </h1> </section> <div class="display-flex flex-column margin-bottom-2" > <span class="text-base line-height-body-5" > Report ID </span> <span> x0000xx0-0xx0-0000-0x00-00x000x0x000 </span> </div> <div class="display-flex flex-column" > <h2> React Unit Testing </h2> <div class="display-flex flex-column margin-bottom-2" > <span class="text-base line-height-body-5" > Data Stream </span> <span> PRIMARY </span> </div> <div class="display-flex flex-column margin-bottom-2" > <span class="text-base line-height-body-5" > Transmission Date </span> <span> 27 Feb 2025 </span> </div> <div class="display-flex flex-column margin-bottom-2" > <span class="text-base line-height-body-5" > Transmission Time </span> <span> 01:44 </span> </div> <div class="display-flex flex-column margin-bottom-2" > <span class="text-base line-height-body-5" > Records </span> <span> 3 </span> </div> </div> <div class="display-flex flex-column" > <h2> Different Org </h2> <div class="display-flex flex-column margin-bottom-2" > <span class="text-base line-height-body-5" > Data Stream </span> <span> SECONDARY </span> </div> <div class="display-flex flex-column margin-bottom-2" > <span class="text-base line-height-body-5" >
src/utils/DateTimeUtils.test.ts > submission details date display > SubmissionDates have valid format: frontend-react/src/utils/DateTimeUtils.test.ts#L26
AssertionError: expected '27 Feb 2025' to be '7 Apr 1970' // Object.is equality Expected: "7 Apr 1970" Received: "27 Feb 2025" ❯ src/utils/DateTimeUtils.test.ts:26:44
src/utils/DateTimeUtils.test.ts > generateDateTitles > returns null for invalid date strings: frontend-react/src/utils/DateTimeUtils.test.ts#L34
AssertionError: expected { dateString: '27 Feb 2025', …(1) } to strictly equal { Object (dateString, timeString) } - Expected + Received { - "dateString": "N/A", - "timeString": "N/A", + "dateString": "27 Feb 2025", + "timeString": "01:46", } ❯ src/utils/DateTimeUtils.test.ts:34:30
src/pages/submissions/SubmissionDetails.test.tsx > SubmissionDetails > renders data to sub-components: frontend-react/src/pages/submissions/SubmissionDetails.test.tsx#L70
TestingLibraryElementError: Unable to find an element with the text: 7 Apr 1970. This could be because the text is broken up by multiple elements. In this case, you can provide a function for your text matcher to make your matcher more flexible. Ignored nodes: comments, script, style <body> <div> <div class="grid-container" data-testid="gridContainer" > <div> <nav aria-label="Breadcrumbs" class="usa-breadcrumb" > <ol class="usa-breadcrumb__list" > <li class="usa-breadcrumb__list-item" > <a class="usa-link usa-breadcrumb__link" href="/submissions" > Submissions </a> </li> <li aria-current="page" class="usa-breadcrumb__list-item usa-current" > Details: undefined </li> </ol> </nav> </div> <div class="margin-bottom-10" data-testid="container" > <div class="grid-col-12" > <section class="margin-bottom-5 maxw-mobile-lg" > <h2 class="margin-bottom-0" > <span class="text-normal font-body-md text-base margin-bottom-0" > Jest TEST Submissions </span> </h2> <h1 class="margin-top-1 margin-bottom-0" > 27 Feb 2025 01:46 - SubmissionDetails Unit Test </h1> </section> <div class="display-flex flex-column margin-bottom-2" > <span class="text-base line-height-body-5" > Report ID </span> <span> x0000xx0-0xx0-0000-0x00-00x000x0x000 </span> </div> <div class="display-flex flex-column" > <h2> React Unit Testing </h2> <div class="display-flex flex-column margin-bottom-2" > <span class="text-base line-height-body-5" > Data Stream </span> <span> PRIMARY </span> </div> <div class="display-flex flex-column margin-bottom-2" > <span class="text-base line-height-body-5" > Transmission Date </span> <span> 27 Feb 2025 </span> </div> <div class="display-flex flex-column margin-bottom-2" > <span class="text-base line-height-body-5" > Transmission Time </span> <span> 01:46 </span> </div> <div class="display-flex flex-column margin-bottom-2" > <span class="text-base line-height-body-5" > Records </span> <span> 3 </span> </div> </div> <div class="display-flex flex-column" > <h2> Different Org </h2> <div class="display-flex flex-column margin-bottom-2" > <span class="text-base line-height-body-5" > Data Stream </span> <span> SECONDARY </span> </div> <div class="display-flex flex-column margin-bottom-2" > <span class="text-base line-height-body-5" >
SonarCloud/CodeQL scan (java-kotlin)
Final attempt failed. Child_process exited with error code 1
SonarCloud/CodeQL scan (java-kotlin)
Attempt 1 failed. Reason: Child_process exited with error code 1